{"text_format":"1","workbook":"xlsx","n_sheets":4,"sheets":["LAB_GC","Lookup","SampleCat","Instructions"],"not_rendered":{"charts":0,"images":1,"macros":1,"external_links":0,"defined_names":10,"comments":0,"pivot_tables":0},"unopened":[],"bounds":{"document_bytes":16777216,"sheet_cells":100000,"rows_first":2000,"rows_last":500,"rows_between":2000,"halvings":0,"cell_chars":16384,"cell_head_chars":4096},"cells_cut":0,"cells_raw":0,"read":"whole","date_system":"1900"}

{"sheet":"LAB_GC","index":0,"n_rows":13,"n_cols":24,"rows_kept":13,"cut":false,"hidden":false,"merged":[[10,0,10,11],[10,12,10,23],[8,0,8,2],[0,7,0,12],[0,0,0,5],[1,0,1,5],[2,0,2,5],[6,0,6,1],[6,2,6,5]]}
[null,null,null,null,null,null,null,"Chemical\nSample Submission Report (SSR)"]
["Central Office\n50 W Town Street\nColumbus, Ohio 43215\n(614) 644-2752     FAX (614) 644-2909"]
[]
["Version","xxxx"]
["Last Updated","2024-08-01"]
[]
["Reporting Lab Certification Number*:"]
[]
["NOTE: Begin entering samples in row 13"]
["* - Indicates Required Field"]
["Sample Information",null,null,null,null,null,null,null,null,null,null,null,"Analysis Results"]
["Lab Sample Number*","PWS ID Number*","Water Facility State Code*","Sample Point ID*","Sample Collection Date*","Sample Collection Time (HHMM)","Lab Receipt Date","Sample Rejection Reason","Sample Type*","Pb/Cu Location Type","Collection Address","Comments","Analyte Code*","Analysis Completion Date*","Analysis Completion Time (HHMM)","Data Quality*","Data Quality Reason","Analysis Method Code*","Less Than Indicator*","Result*","Result Unit Code*","Analytical Lab","Analyst","QC Date"]
[null,null,null,null,null,null,null,null,"Routine-Compliance"]

{"sheet":"Lookup","index":1,"n_rows":81,"n_cols":3,"rows_kept":81,"cut":false,"hidden":false,"merged":[]}
["Sample Type Search","Routine-Compliance"]
["Sample Type Result",{"$f":"OFFSET(OFFSET($A$1,MATCH(\"Sample Type\",A:A,0)-1,0,1,1),MATCH(B1,OFFSET(OFFSET($A$1,MATCH(\"Sample Type\",A:A,0)-1,0,1,1),0,2,COUNTIF(A:A,\"Sample Type\"),1),0)-1,1,1,1)","v":"RT"}]
["Location Type Search","First Draw"]
["Location Type Result",{"$f":"OFFSET(OFFSET($A$1,MATCH(\"Pb/Cu Location Type\",A:A,0)-1,0,1,1),MATCH(B3,OFFSET(OFFSET($A$1,MATCH(\"Pb/Cu Location Type\",A:A,0)-1,0,1,1),0,2,COUNTIF(A:A,\"Pb/Cu Location Type\"),1),0)-1,1,1,1)","v":"FSD"}]
["Data Quality Reason Search","Requestor Cancelled"]
["Data Quality Reason Result",{"$f":"OFFSET(OFFSET($A$1,MATCH(\"Data Quality Reason\",A:A,0)-1,0,1,1),MATCH(B5,OFFSET(OFFSET($A$1,MATCH(\"Data Quality Reason\",A:A,0)-1,0,1,1),0,2,COUNTIF(A:A,\"Data Quality Reason\"),1),0)-1,1,1,1)","v":"RC"}]
["Data Quality Search","Accepted"]
["Data Quality Result",{"$f":"OFFSET(OFFSET($A$1,MATCH(\"Data Quality\",A:A,0)-1,0,1,1),MATCH(B7,OFFSET(OFFSET($A$1,MATCH(\"Data Quality\",A:A,0)-1,0,1,1),0,2,COUNTIF(A:A,\"Data Quality\"),1),0)-1,1,1,1)","v":"A"}]
["Current Date",{"$f":"NOW()","v":"2025-07-16T11:09:33.100"}]
["Analyte Code Search","0500| FILTER BACKWASH RULE"]
["Analyte Code Result",{"$f":"OFFSET(OFFSET($A$1,MATCH(\"Analyte Code\",A:A,0)-1,0,1,1),MATCH(B10,OFFSET(OFFSET($A$1,MATCH(\"Analyte Code\",A:A,0)-1,0,1,1),0,2,COUNTIF(A:A,\"Analyte Code\"),1),0)-1,1,1,1)","v":{"$error":"#N/A"}}]
["Sample Rejection Reason Search","Lab Accident"]
["Sample Rejection Reason Result",{"$f":"OFFSET(OFFSET($A$1,MATCH(\"Sample Rejection Reason\",A:A,0)-1,0,1,1),MATCH(B12,OFFSET(OFFSET($A$1,MATCH(\"Sample Rejection Reason\",A:A,0)-1,0,1,1),0,2,COUNTIF(A:A,\"Analyte Code\"),1),0)-1,1,1,1)","v":"LA"}]
["Field Name","Code","Dropdown"]
["Replacement Indicator","Y","Yes"]
["Replacement Indicator","N","No"]
["Compliance Sample?","Y","Yes"]
["Compliance Sample?","N","No"]
["Sample Type","RT","Routine-Compliance"]
["Sample Type","PE","Performance Evaluation"]
["Sample Type","SP","Special-Non Compliance"]
["Pb/Cu Location Type","ATS","At Source"]
["Pb/Cu Location Type","FLS","Flushed"]
["Pb/Cu Location Type","FSD","First Draw"]
["Pb/Cu Location Type","LSL","Lead Service Line"]
["Data Quality","A","Accepted"]
["Data Quality","R","Rejected"]
["Sample Rejection Reason","BR","Broken"]
["Sample Rejection Reason","CL","Chlorine Present"]
["Sample Rejection Reason","EH","Exceeds Holding Time"]
["Sample Rejection Reason","HS","Excessive Headspace"]
["Sample Rejection Reason","FZ","Frozen Sample"]
["Sample Rejection Reason","IN","Insufficient Sample Information"]
["Sample Rejection Reason","VO","Insufficient Volume"]
["Sample Rejection Reason","BP","Invalid Sampling Point"]
["Sample Rejection Reason","IP","Invalid Sampling Protocol"]
["Sample Rejection Reason","LA","Lab Accident"]
["Sample Rejection Reason","LT","Leaked in Transit"]
["Less Than Indicator","Y","<"]
["Less Than Indicator","N"]
["Column1","Column2","Column3"]
["Result Unit Code","MG/L","MG/L"]
["Result Unit Code","UG/L","UG/L"]
["Result Unit Code","NG/L","NG/L"]
["Data Quality Reason","IF","Instrument Failure"]
["Data Quality Reason","LC","Lab Not Certified"]
["Data Quality Reason","LE","Lab Error"]
["Data Quality Reason","OT","Other"]
["Data Quality Reason","RC","Requestor Cancelled"]
["Data Quality Reason","WR","Water System Rejected"]
["Column1","Column2","Column3"]
["Analyte Code",1083,"1083| LITHIUM, TOTAL"]
["Analyte Code",2801,"2801| PERFLUOROBUTANESULFONIC ACID (PFBS)"]
["Analyte Code",2802,"2802| PERFLUOROHEPTANOIC ACID (PFHPA)"]
["Analyte Code",2803,"2803| PERFLUOROHEXANE SULFONIC ACID (PFHXS)"]
["Analyte Code",2804,"2804| PERFLUORONONANOIC ACID (PFNA)"]
["Analyte Code",2805,"2805| PERFLUOROCTANE SULFONIC ACID (PFOS)"]
["Analyte Code",2806,"2806| PERFLUOROCTANOIC ACID (PFOA)"]
["Analyte Code",2807,"2807| PERFLUORODECANOIC ACID (PFDA)"]
["Analyte Code",2808,"2808| PERFLUORODODECANOIC ACID (PFDOA)"]
["Analyte Code",2809,"2809| PERFLUOROHEXANOIC ACID (PFHXA)"]
["Analyte Code",2810,"2810| PERFLUOROTETRADECANOIC ACID (PFTA)"]
["Analyte Code",2811,"2811| PERFLUOROTRIDECANOIC ACID (PFTRDA)"]
["Analyte Code",2812,"2812| PERFLUOROUNDECANOIC ACID (PFUNA)"]
["Analyte Code",2813,"2813| 11CL-PF3OUDS"]
["Analyte Code",2814,"2814| 9CL-PF3ONS"]
["Analyte Code",2815,"2815| ADONA"]
["Analyte Code",2816,"2816| HFPO-DA"]
["Analyte Code",2817,"2817| NETFOSAA"]
["Analyte Code",2818,"2818| NMEFOSAA"]
["Analyte Code",2819,"2819| PERFLUOROBUTANOIC ACID (PFBA)"]
["Analyte Code",2820,"2820| PERFLUOROOCTANE SULFONIC ACID 6:2 FTS"]
["Analyte Code",2821,"2821| PERFLUOROHEXANE SULFONIC ACID 4:2 FTS"]
["Analyte Code",2822,"2822| PERFLUORODECANE SULFONIC ACID 8:2 FTS"]
["Analyte Code",2823,"2823| PERFLUORO PFMPA"]
["Analyte Code",2824,"2824| PERFLUOROPENTANOIC ACID (PFPEA)"]
["Analyte Code",2825,"2825| PERFLUORO PFMBA"]
["Analyte Code",2826,"2826| PERFLUORO PFEESA"]
["Analyte Code",2827,"2827| NONAFLUORO NFDHA"]
["Analyte Code",2828,"2828| PERFLUOROPENTANESULFONIC ACID (PFPES)"]
["Analyte Code",2829,"2829| PERFLUOROHEPTANESULFONIC ACID (PFHPS)"]

{"sheet":"SampleCat","index":2,"n_rows":712,"n_cols":4,"rows_kept":712,"cut":false,"hidden":false,"merged":[]}
["Current Sample Category Search","1,1,1,2-TETRACHLOROETHANE               "]
["Current Sample Category Result",{"$f":"OFFSET($A$1,MATCH(B1,A:A,0)-1,2,1,1)","v":{"$error":"#N/A"}}]
["Curren tSample Name Result",{"$f":"OFFSET($A$1,MATCH(B1,A:A,0)-1,3,1,1)","v":{"$error":"#N/A"}}]
[]
[]
["Parameter Code","Paramter Code Context","Sample Category","Analyte Name"]
[2986,"SDWIS","GE","1,1,1,2-TETRACHLOROETHANE               "]
[2956,"SDWIS","GE","1,1,1-TRICHLORO-2-PROPANONE             "]
[2981,"SDWIS","GE","1,1,1-TRICHLOROETHANE                   "]
[2464,"SDWIS","GE","1,1,1-TRICHLOROPROPANONE                "]
[2988,"SDWIS","GE","1,1,2,2-TETRACHLOROETHANE               "]
[2985,"SDWIS","GE","1,1,2-TRICHLOROETHANE                   "]
[2957,"SDWIS","GE","1,1-DICHLORO-2-PROPANONE                "]
[2978,"SDWIS","GE","1,1-DICHLOROETHANE                      "]
[2977,"SDWIS","GE","1,1-DICHLOROETHYLENE                    "]
[2463,"SDWIS","GE","1,1-DICHLOROPROPANONE                   "]
[2410,"SDWIS","GE","1,1-DICHLOROPROPENE                     "]
[2419,"SDWIS","GE","1,2,3 - TRIMETHYLBENZENE                "]
[2420,"SDWIS","GE","1,2,3-TRICHLOROBENZENE                  "]
[2414,"SDWIS","GE","1,2,3-TRICHLOROPROPANE                  "]
[2378,"SDWIS","GE","1,2,4-TRICHLOROBENZENE                  "]
[2418,"SDWIS","GE","1,2,4-TRIMETHYLBENZENE                  "]
[2232,"SDWIS","GE","1,2-DIBROMOETHYLENE                     "]
[2980,"SDWIS","GE","1,2-DICHLOROETHANE                      "]
[2983,"SDWIS","GE","1,2-DICHLOROPROPANE                     "]
[2268,"SDWIS","GE","1,2-DIPHENYLHYDRAZINE                   "]
[2377,"SDWIS","GE","1,3,5-TRICHLOROBENZENE                  "]
[2424,"SDWIS","GE","1,3,5-TRIMETHYLBENZENE                  "]
[2412,"SDWIS","GE","1,3-DICHLOROPROPANE                     "]
[2413,"SDWIS","GE","1,3-DICHLOROPROPENE                     "]
[2655,"SDWIS","GE","1,3-DICHLOROPROPYLENE                   "]
[2049,"SDWIS","GE","1,4-DIOXANE                             "]
[2086,"SDWIS","GE","1-CHLOROBUTANE                          "]
[2087,"SDWIS","GE","1-CHLOROHEXANE                          "]
[2315,"SDWIS","GE","1-METHYL-NAPHTHALENE                    "]
[2259,"SDWIS","GE","1-NAPTHOL (1-HYDORXYNAPTHTHALENE)       "]
[2416,"SDWIS","GE","2,2-DICHLOROPROPANE                     "]
[2063,"SDWIS","GE","2,3,7,8 TCDD (DIOXIN)                   "]
[2336,"SDWIS","GE","2,4 DIMETHYLPHENOL                      "]
[2111,"SDWIS","GE","2,4,5-T                                 "]
[2110,"SDWIS","GE","2,4,5-TP (SILVEX)                       "]
[2242,"SDWIS","GE","2,4,5-TRICHLOROPHENOL                   "]
[2332,"SDWIS","GE","2,4,6-TRICHLOROPHENOL                   "]
[2106,"SDWIS","GE","2,4,DB                                  "]
[2105,"SDWIS","GE","2,4-D                                   "]
[2334,"SDWIS","GE","2,4-DICHLOROPHENOL                      "]
[2328,"SDWIS","GE","2,4-DINITROPHENOL                       "]
[2270,"SDWIS","GE","2,4-DINITROTOLUENE                      "]
[2266,"SDWIS","GE","2,6-DINITROTOLUENE                      "]
[2234,"SDWIS","GE","2-CHLOROETHYLVINYL ETHER                "]
[2258,"SDWIS","GE","2-CHLORONAPHTHALENE                     "]
[2344,"SDWIS","GE","2-CHLOROPHENOL                          "]
[2269,"SDWIS","GE","2-HEXANONE                              "]
[2241,"SDWIS","GE","2-METHYL NAPHTHALENE                    "]
[2227,"SDWIS","GE","2-METHYL-4,6-DINITROPHENOL              "]
[2233,"SDWIS","GE","2-METHYLPHENOL                          "]
[2200,"SDWIS","GE","2-NITROANILINE                          "]
[2340,"SDWIS","GE","2-NITROPHENOL                           "]
[2469,"SDWIS","GE","2-NITROPROPANE                          "]
[2320,"SDWIS","GE","3,3-DICHLOROBENZIDINE                   "]
[2109,"SDWIS","GE","3,4-DICHLOROBENZOIC ACID                "]
[2066,"SDWIS","GE","3-HYDROXYCARBOFURAN                     "]
[2201,"SDWIS","GE","3-NITROANILINE                          "]
[2346,"SDWIS","GE","4,6-DINITRO-O-CRESOL                    "]
[2276,"SDWIS","GE","4-BROMOPHENYL PHENYL ETHER              "]
[2318,"SDWIS","GE","4-CHLORO-PHENYL-PHENYL ETHER            "]
[2239,"SDWIS","GE","4-CHLOROANILINE                         "]
[2235,"SDWIS","GE","4-METHYLPHENOL                          "]
[2203,"SDWIS","GE","4-NITROANILINE                          "]
[2342,"SDWIS","GE","4-NITROPHENOL                           "]
[2261,"SDWIS","GE","ACENAPHTHENE                            "]
[2260,"SDWIS","GE","ACENAPHTHYLENE                          "]
[2470,"SDWIS","GE","ACETALDHYDE                             "]
[2449,"SDWIS","GE","ACETIC ACID (ETHANOIC ACID)             "]
[2243,"SDWIS","GE","ACETONE                                 "]
[1069,"SDWIS","GE","ACIDITY, M.O. (CACO3)                   "]
[1068,"SDWIS","GE","ACIDITY, TOTAL (CACO3)                  "]
[2108,"SDWIS","GE","ACIFLUORFEN                             "]
[2238,"SDWIS","GE","ACROLEIN                                "]
[2265,"SDWIS","GE","ACRYLAMIDE                              "]
[2240,"SDWIS","GE","ACRYLONITRILE                           "]
[2027,"SDWIS","GE","ACTECHLOR                               "]
[3011,"SDWIS","GE","ACTINOMYCETES                           "]
[3430,"SDWIS","GE","ADENOVIRUSES                            "]
[3026,"SDWIS","GE","AEROMONAS                               "]
[3200,"SDWIS","GE","AEROMONAS HYDROPHILIA                   "]
[1994,"SDWIS","GE","AGGRESSIVE INDEX                        "]
[2051,"SDWIS","GE","ALACHLOR (LASSO)                        "]
[2004,"SDWIS","GE","ALACHLOR ESA                            "]
[2047,"SDWIS","GE","ALDICARB                                "]
[2044,"SDWIS","GE","ALDICARB SULFONE                        "]
[2043,"SDWIS","GE","ALDICARB SULFOXIDE                      "]
[2356,"SDWIS","GE","ALDRIN                                  "]
[3310,"SDWIS","GE","ALGAE TOXINS                            "]
[1928,"SDWIS","GE","ALKALINITY, BICARBONATE                 "]
[1067,"SDWIS","GE","ALKALINITY, CACO3 STABILITY             "]
[1929,"SDWIS","GE","ALKALINITY, CARBONATE                   "]
[1931,"SDWIS","GE","ALKALINITY, PHENOLPHTALEIN              "]
[1927,"SDWIS","GE","ALKALINITY, TOTAL                       "]
[2402,"SDWIS","GE","ALLYL CHLORIDE                          "]
[1002,"SDWIS","GE","ALUMINUM                                "]
[2620,"SDWIS","GE","AMIBEN                                  "]
[2097,"SDWIS","GE","AMPA, AMINOMETHYLPHOSPHONIC ACID        "]
[2081,"SDWIS","GE","AMYL ACETATE                            "]
[2230,"SDWIS","GE","ANILINE                                 "]
[2280,"SDWIS","GE","ANTHRACENE                              "]
[1074,"SDWIS","GE","ANTIMONY                                "]
[4240,"SDWIS","GE","ANTIMONY-122                            "]
[4242,"SDWIS","GE","ANTIMONY-124                            "]
[4244,"SDWIS","GE","ANTIMONY-125                            "]
[4246,"SDWIS","GE","ANTIMONY-127                            "]
[2485,"SDWIS","GE","AOC/BDOC                                "]
[2388,"SDWIS","GE","AROCLOR 1016 (PCB)                      "]
[2390,"SDWIS","GE","AROCLOR 1221 (PCB)                      "]
[2392,"SDWIS","GE","AROCLOR 1232 (PCB)                      "]
[2394,"SDWIS","GE","AROCLOR 1242 (PCB)                      "]
[2396,"SDWIS","GE","AROCLOR 1248 (PCB)                      "]
[2398,"SDWIS","GE","AROCLOR 1254 (PCB)                      "]
[2400,"SDWIS","GE","AROCLOR 1260 (PCB)                      "]
[1005,"SDWIS","GE","ARSENIC                                 "]
[4152,"SDWIS","GE","ARSENIC-73                              "]
[4154,"SDWIS","GE","ARSENIC-74                              "]
[4156,"SDWIS","GE","ARSENIC-76                              "]
[4158,"SDWIS","GE","ARSENIC-77                              "]
[1094,"SDWIS","GE","ASBESTOS                                "]
[2050,"SDWIS","GE","ATRAZINE                                "]
[2059,"SDWIS","GE","AZINPHOS-METHYL (GUITHON)               "]
[2204,"SDWIS","GE","AZOBENZENE                              "]
[1010,"SDWIS","GE","BARIUM                                  "]
[4278,"SDWIS","GE","BARIUM-140                              "]
[9999,"SDWIS","GE","BENEZENE 2                              "]
[2207,"SDWIS","GE","BENFLURALIN (BENETIN)                   "]
[2625,"SDWIS","GE","BENTAZON (BASAGRAN)                     "]
[2479,"SDWIS","GE","BENZALDEHYDE                            "]
[2990,"SDWIS","GE","BENZENE                                 "]
[2292,"SDWIS","GE","BENZIDINE                               "]
[2300,"SDWIS","GE","BENZO (A) ANTHRACENE                    "]
[2306,"SDWIS","GE","BENZO (A) PYRENE                        "]
[2302,"SDWIS","GE","BENZO (B) FLUORANTHENE                  "]
[2312,"SDWIS","GE","BENZO (G,H,I) PERYLENE                  "]
[2304,"SDWIS","GE","BENZO (K) FLUORANTHENE                  "]
[2237,"SDWIS","GE","BENZOIC ACID                            "]
[2231,"SDWIS","GE","BENZYL ALCOHOL                          "]
[1075,"SDWIS","GE","BERYLLIUM                               "]
[4106,"SDWIS","GE","BERYLLIUM-10                            "]
[4104,"SDWIS","GE","BERYLLIUM-7                             "]
[2348,"SDWIS","GE","BHC-ALPHA                               "]
[2350,"SDWIS","GE","BHC-BETA                                "]
[2354,"SDWIS","GE","BHC-DELTA                               "]
[2010,"SDWIS","GE","BHC-GAMMA (LINDANE)                     "]
[1026,"SDWIS","GE","BICARBONATE AS HCO3                     "]
[2250,"SDWIS","GE","BIS(2-CHLOROETHOXY) METHANE             "]
[2222,"SDWIS","GE","BIS(2-CHLOROETHYL) ETHER                "]
[2244,"SDWIS","GE","BIS(2-CHLOROISOPROPYL) ETHER            "]
[2298,"SDWIS","GE","BIS(2-ETHYLHEXYL) PHTHALATE             "]
[2324,"SDWIS","GE","BIS(CHLOROMETHYL) ETHER                 "]
[1078,"SDWIS","GE","BISMUTH                                 "]
[4374,"SDWIS","GE","BISMUTH-206                             "]
[4376,"SDWIS","GE","BISMUTH-207                             "]
[4378,"SDWIS","GE","BISMUTH-210                             "]
[1091,"SDWIS","GE","BOD, 5DAY                               "]
[2635,"SDWIS","GE","BOLSTAR                                 "]
[1079,"SDWIS","GE","BORON                                   "]
[2098,"SDWIS","GE","BROMACIL                                "]
[1011,"SDWIS","GE","BROMATE                                 "]
[1004,"SDWIS","GE","BROMIDE                                 "]
[4164,"SDWIS","GE","BROMIDE-82                              "]
[2993,"SDWIS","GE","BROMOBENZENE                            "]
[2455,"SDWIS","GE","BROMOCHLOROACETIC ACID                  "]
[2339,"SDWIS","GE","BROMOCHLOROACETIC ACID                  "]
[2462,"SDWIS","GE","BROMOCHLOROACETONITRILE                 "]
[2951,"SDWIS","GE","BROMOCHLOROACETONITRILE                 "]
[2430,"SDWIS","GE","BROMOCHLOROMETHANE                      "]
[2943,"SDWIS","GE","BROMODICHLOROMETHANE                    "]
[2942,"SDWIS","GE","BROMOFORM                               "]
[2214,"SDWIS","GE","BROMOMETHANE                            "]
[2209,"SDWIS","GE","BROMOXYNIL                              "]
[2076,"SDWIS","GE","BUTACHLOR (MACHETE)                     "]
[2472,"SDWIS","GE","BUTANAL                                 "]
[2082,"SDWIS","GE","BUTANE                                  "]
[2083,"SDWIS","GE","BUTYL ACETATE                           "]
[2053,"SDWIS","GE","BUTYLATE (SUTAN)                        "]
[2294,"SDWIS","GE","BUTYLBENZYL PHTHALATE                   "]
[1015,"SDWIS","GE","CADMIUM                                 "]
[4224,"SDWIS","GE","CADMIUM-109                             "]
[4226,"SDWIS","GE","CADMIUM-113M                            "]
[4230,"SDWIS","GE","CADMIUM-115                             "]
[4228,"SDWIS","GE","CADMIUM-115M                            "]
[1019,"SDWIS","GE","CALCIUM                                 "]
[1919,"SDWIS","GE","CALCIUM                                 "]
[1016,"SDWIS","GE","CALCIUM                                 "]
[4118,"SDWIS","GE","CALCIUM-45                              "]
[4120,"SDWIS","GE","CALCIUM-47                              "]
[3420,"SDWIS","GE","CALICIVIRUSES                           "]
[3019,"SDWIS","GE","CAMPYLOBACTER JEJUNI                    "]
[2021,"SDWIS","GE","CARBARYL                                "]
[2046,"SDWIS","GE","CARBOFURAN                              "]
[1018,"SDWIS","GE","CARBON                                  "]
[1901,"SDWIS","GE","CARBON DIOXIDE                          "]
[1902,"SDWIS","GE","CARBON DISULFIDE                        "]
[2982,"SDWIS","GE","CARBON TETRACHLORIDE                    "]
[2920,"SDWIS","GE","CARBON, TOTAL ORGANIC (TOC)             "]
[4108,"SDWIS","GE","CARBON-14                               "]
[4282,"SDWIS","GE","CERIUM-141                              "]
[4284,"SDWIS","GE","CERIUM-143                              "]
[4286,"SDWIS","GE","CERIUM-144                              "]
[4266,"SDWIS","GE","CESIUM-131                              "]
[4270,"SDWIS","GE","CESIUM-134                              "]
[4272,"SDWIS","GE","CESIUM-135                              "]
[4274,"SDWIS","GE","CESIUM-136                              "]
[4276,"SDWIS","GE","CESIUM-137                              "]
[2460,"SDWIS","GE","CHLORAL HYDRATE                         "]
[2952,"SDWIS","GE","CHLORAL HYDRATE                         "]
[2205,"SDWIS","GE","CHLORAMBEN                              "]
[1006,"SDWIS","GE","CHLORAMINE RESIDUAL                     "]
[1007,"SDWIS","GE","CHLORATE                                "]
[2959,"SDWIS","GE","CHLORDANE                               "]
[1017,"SDWIS","GE","CHLORIDE                                "]
[999,"SDWIS","GE","CHLORINE                                "]
[1008,"SDWIS","GE","CHLORINE DIOXIDE RESIDUAL               "]
[1012,"SDWIS","GE","CHLORINE RESIDUAL                       "]
[1013,"SDWIS","GE","CHLORINE RESIDUAL, FREE                 "]
[4116,"SDWIS","GE","CHLORINE-36                             "]
[1009,"SDWIS","GE","CHLORITE                                "]
[2466,"SDWIS","GE","CHLOROACETONITRILE                      "]
[2944,"SDWIS","GE","CHLORODIBROMOMETHANE                    "]
[2216,"SDWIS","GE","CHLOROETHANE                            "]
[2941,"SDWIS","GE","CHLOROFORM                              "]
[2210,"SDWIS","GE","CHLOROMETHANE                           "]
[2953,"SDWIS","GE","CHLOROPICRIN                            "]
[2465,"SDWIS","GE","CHLOROPICRIN                            "]
[2057,"SDWIS","GE","CHLORPYRIFOS (LORSBAN)                  "]
[2215,"SDWIS","GE","CHLORPYRIPHOS                           "]
[2217,"SDWIS","GE","CHLORSULFURON                           "]
[2213,"SDWIS","GE","CHLORTHALONL                            "]
[1020,"SDWIS","GE","CHROMIUM                                "]
[1080,"SDWIS","GE","CHROMIUM, HEXAVALENT                    "]
[4130,"SDWIS","GE","CHROMIUM-51                             "]
[2296,"SDWIS","GE","CHRYSENE                                "]
[2380,"SDWIS","GE","CIS-1,2-DICHLOROETHYLENE                "]
[2228,"SDWIS","GE","CIS-1,3-DICHLOROPROPENE                 "]
[3025,"SDWIS","GE","CITROBACTER                             "]
[3018,"SDWIS","GE","CLOSTRIDIUM                             "]
[1081,"SDWIS","GE","COBALT                                  "]
[4138,"SDWIS","GE","COBALT-57                               "]
[4140,"SDWIS","GE","COBALT-58                               "]
[4142,"SDWIS","GE","COBALT-60                               "]
[3014,"SDWIS","GE","COLIFORM, E. COLI                       "]
[3013,"SDWIS","GE","COLIFORM, FECAL                         "]
[3000,"SDWIS","GE","COLIFORM, TOTAL (PRE-TCR)               "]
[3100,"SDWIS","GE","COLIFORM, TOTAL (TCR)                   "]
[1905,"SDWIS","GE","COLOR                                   "]
[1001,"SDWIS","GE","COMBINED CHLORINE                       "]
[1064,"SDWIS","GE","CONDUCTIVITY                            "]
[7000,"SDWIS","GE","CONSUMER CONFIDENCE REPORTS RULE        "]
[1022,"SDWIS","PB","COPPER                                  "]
[1910,"SDWIS","GE","CORROSIVITY                             "]
[2545,"SDWIS","GE","COUNTER (TERBOFUS)                      "]
[3410,"SDWIS","GE","COXSACHIEVIRUSES                        "]
[2078,"SDWIS","GE","CRYPTOSPORIDIUM                         "]
[3015,"SDWIS","GE","CRYPTOSPORIDIUM                         "]
[2054,"SDWIS","GE","CYANAZINE                               "]
[1024,"SDWIS","GE","CYANIDE                                 "]
[1023,"SDWIS","GE","CYANIDE, FREE                           "]
[3300,"SDWIS","GE","CYANOBACTERIA (BLUE GREEN ALGAE)        "]
[2080,"SDWIS","GE","CYANOGEN CHLORIDE                       "]
[2099,"SDWIS","GE","DACTHAL (DCPA)                          "]
[2031,"SDWIS","GE","DALAPON                                 "]
[2101,"SDWIS","GE","DCPA DI ACID DEGRADATE                  "]
[2100,"SDWIS","GE","DCPA MONO ACID DEGRADATE                "]
[2367,"SDWIS","GE","DDD, ORTHO-PARA                         "]
[2071,"SDWIS","GE","DDD, PARA-PARA                          "]
[2365,"SDWIS","GE","DDE, ORTHO-PARA                         "]
[2069,"SDWIS","GE","DDE, PARA-PARA                          "]
[2369,"SDWIS","GE","DDT, ORTHO-PARA                         "]
[2075,"SDWIS","GE","DDT, PARA-PARA                          "]
[2481,"SDWIS","GE","DECANAL                                 "]
[2384,"SDWIS","GE","DECHLOROBIPHENYL                        "]
[2006,"SDWIS","GE","DES-ETHYL-ATRAZINE                      "]
[2007,"SDWIS","GE","DES-ISOPROPYL-ATRAZINE                  "]
[2035,"SDWIS","GE","DI(2-ETHYLHEXYL) - ADIPATE              "]
[2039,"SDWIS","GE","DI(2-ETHYLHEXYL) - PHTHALATE            "]
[2290,"SDWIS","GE","DI-N-BUTYL PHTHALATE                    "]
[2223,"SDWIS","GE","DI-N-OCTYL PHTHALATE                    "]
[2056,"SDWIS","GE","DIAZINON (SPECTRACIDE)                  "]
[2310,"SDWIS","GE","DIBENZO (A,H) ANTHRACENE                "]
[2202,"SDWIS","GE","DIBENZOFURAN                            "]
[2329,"SDWIS","GE","DIBROMOACETIC ACID                      "]
[2454,"SDWIS","GE","DIBROMOACETIC ACID                      "]
[2079,"SDWIS","GE","DIBROMOACETONITRILE                     "]
[2931,"SDWIS","GE","DIBROMOCHLOROPROPANE (DBCP)             "]
[2408,"SDWIS","GE","DIBROMOMETHANE                          "]
[2440,"SDWIS","GE","DICAMBA                                 "]
[2933,"SDWIS","GE","DICHLORAN; (BOTRAN)                     "]
[2650,"SDWIS","GE","DICHLORETHYLENE                         "]
[2451,"SDWIS","GE","DICHLOROACETIC ACID                     "]
[2331,"SDWIS","GE","DICHLOROACETIC ACID                     "]
[2461,"SDWIS","GE","DICHLOROACETONITRILE                    "]
[2954,"SDWIS","GE","DICHLOROACETONITRILE                    "]
[2401,"SDWIS","GE","DICHLOROBENZENES                        "]
[2212,"SDWIS","GE","DICHLORODIFLUOROMETHANE                 "]
[2975,"SDWIS","GE","DICHLOROIODOMETHANE                     "]
[2964,"SDWIS","GE","DICHLOROMETHANE                         "]
[2206,"SDWIS","GE","DICHLORPROP                             "]
[2220,"SDWIS","GE","DICHROTOPHOS (DEMETON - CO)             "]
[2070,"SDWIS","GE","DIELDRIN                                "]
[2284,"SDWIS","GE","DIETHYL PHTHALATE                       "]
[2236,"SDWIS","GE","DIIODOMETHANE                           "]
[2221,"SDWIS","GE","DIMETHOATE                              "]
[2282,"SDWIS","GE","DIMETHYL PHTHALATE                      "]
[2041,"SDWIS","GE","DINOSEB                                 "]
[2032,"SDWIS","GE","DIQUAT                                  "]
[400,"SDWIS","GE","DISINFECTION BYPRODUCTS RULE            "]
[2919,"SDWIS","GE","DISSOLVED ORGANIC CARBON (DOC)          "]
[2102,"SDWIS","GE","DISULFOTON                              "]
[2103,"SDWIS","GE","DIURON                                  "]
[2570,"SDWIS","GE","DYFONATE                                "]
[4316,"SDWIS","GE","DYSPROSIUM-166                          "]
[3400,"SDWIS","GE","ECHOVIRUSES                             "]
[2068,"SDWIS","GE","ENDOSULFAN I (ALPHA)                    "]
[2072,"SDWIS","GE","ENDOSULFAN II (BETA)                    "]
[2074,"SDWIS","GE","ENDOSULFAN SULFATE                      "]
[2033,"SDWIS","GE","ENDOTHALL                               "]
[2005,"SDWIS","GE","ENDRIN                                  "]
[2372,"SDWIS","GE","ENDRIN ALDEHYDE                         "]
[3023,"SDWIS","GE","ENTEROBACTER                            "]
[3002,"SDWIS","GE","ENTEROCOCCI                             "]
[2257,"SDWIS","GE","EPICHLOROHYDRIN                         "]
[2052,"SDWIS","GE","EPTAM (EPTC)                            "]
[4322,"SDWIS","GE","ERBIUM-169                              "]
[3027,"SDWIS","GE","ERWINIA                                 "]
[2252,"SDWIS","GE","ETHALFLURALIN                           "]
[2062,"SDWIS","GE","ETHION (ETU)                            "]
[2088,"SDWIS","GE","ETHYL ACETATE                           "]
[2089,"SDWIS","GE","ETHYL ALCOHOL                           "]
[2090,"SDWIS","GE","ETHYL ETHER                             "]
[2293,"SDWIS","GE","ETHYL METHACRYLATE                      "]
[2992,"SDWIS","GE","ETHYLBENZENE                            "]
[2946,"SDWIS","GE","ETHYLENE DIBROMIDE (EDB)                "]
[2960,"SDWIS","GE","ETHYLENE GLYCOL                         "]
[4304,"SDWIS","GE","EUROPIUM-152                            "]
[4306,"SDWIS","GE","EUROPIUM-154                            "]
[4308,"SDWIS","GE","EUROPIUM-155                            "]
[4310,"SDWIS","GE","EUROPIUM-156                            "]
[3003,"SDWIS","GE","FECAL STREPTOCOCCUS                     "]
[500,"SDWIS","GE","FILTER BACKWASH RULE                    "]
[2297,"SDWIS","GE","FLUOMETURON                             "]
[2286,"SDWIS","GE","FLUORANTHENE                            "]
[2264,"SDWIS","GE","FLUORENE                                "]
[1025,"SDWIS","GE","FLUORIDE                                "]
[2905,"SDWIS","GE","FOAMING AGENTS (SURFACTANTS)            "]
[2961,"SDWIS","GE","FORMALDEHYDE                            "]
[3009,"SDWIS","GE","FUNGUS                                  "]
[4312,"SDWIS","GE","GADOLIUM-153                            "]
[4150,"SDWIS","GE","GERANIUM-71                             "]
[3008,"SDWIS","GE","GIARDIA LAMBLIA                         "]
[2474,"SDWIS","GE","GLYOXAL                                 "]
[2034,"SDWIS","GE","GLYPHOSATE                              "]
[4364,"SDWIS","GE","GOLD-196                                "]
[4366,"SDWIS","GE","GOLD-198                                "]
[4109,"SDWIS","GE","GROSS ALPHA PARTICLE ACTIVITY, TOTAL    "]
[4040,"SDWIS","GE","GROSS ALPHA, DISSOLVED                  "]
[4002,"SDWIS","GE","GROSS ALPHA, INCLDNG RA & U, EXCLDNG RN "]
[4000,"SDWIS","GE","GROSS ALPHA, INCLDNG RA, EXCLDNG RN & U "]
[4041,"SDWIS","GE","GROSS ALPHA, SUSPENDED                  "]
[4100,"SDWIS","GE","GROSS BETA PARTICLE ACTIVITY            "]
[4042,"SDWIS","GE","GROSS BETA, DISSOLVED                   "]
[4043,"SDWIS","GE","GROSS BETA, SUSPENDED                   "]
[4332,"SDWIS","GE","HAFNIUM-181                             "]
[1914,"SDWIS","GE","HARDNESS, CALCIUM                       "]
[1918,"SDWIS","GE","HARDNESS, CALCIUM/MAGNESIUM             "]
[1916,"SDWIS","GE","HARDNESS, CARBONATE                     "]
[1917,"SDWIS","GE","HARDNESS, NON-CARBONATE                 "]
[1915,"SDWIS","GE","HARDNESS, TOTAL (AS CACO3)              "]
[1048,"SDWIS","GE","HARDNESS, TOTAL (GR/GAL)                "]
[3210,"SDWIS","GE","HELICOBACTER PYLORI                     "]
[2065,"SDWIS","GE","HEPTACHLOR                              "]
[2067,"SDWIS","GE","HEPTACHLOR EPOXIDE                      "]
[2477,"SDWIS","GE","HEPTANAL                                "]
[3001,"SDWIS","GE","HETEROTROPHIC BACTERIA (HPC)            "]
[2274,"SDWIS","GE","HEXACHLOROBENZENE                       "]
[2246,"SDWIS","GE","HEXACHLOROBUTADIENE                     "]
[2042,"SDWIS","GE","HEXACHLOROCYCLOPENTADIENE               "]
[2225,"SDWIS","GE","HEXACHLOROETHANE                        "]
[2940,"SDWIS","GE","HEXAMETHYLPHOSPHORAMINE (HMPA)          "]
[2476,"SDWIS","GE","HEXANAL                                 "]
[4318,"SDWIS","GE","HOLMIUM-166                             "]
[4320,"SDWIS","GE","HOLMIUM-166M                            "]
[1062,"SDWIS","GE","HYDROCARBONS, EXTRACTABLE IN DIESEL OIL "]
[1065,"SDWIS","GE","HYDROCARBONS, EXTRACTABLE IN WASTE OIL  "]
[1027,"SDWIS","GE","HYDROGEN SULFIDE                        "]
[1021,"SDWIS","GE","HYDROXIDE AS CALCIUM CARBONATE          "]
[2048,"SDWIS","GE","HYPOCHLORITE ION                        "]
[2308,"SDWIS","GE","INDENO (1,2,3-CD) PYRENE                "]
[4232,"SDWIS","GE","INDIUM-115                              "]
[300,"SDWIS","GE","INTERIM ENHANCED SWTR                   "]
[4260,"SDWIS","GE","IODINE-126                              "]
[4262,"SDWIS","GE","IODINE-129                              "]
[4264,"SDWIS","GE","IODINE-131                              "]
[4354,"SDWIS","GE","IRIDIUM-190                             "]
[4356,"SDWIS","GE","IRIDIUM-192                             "]
[1028,"SDWIS","GE","IRON                                    "]
[3006,"SDWIS","GE","IRON BACTERIA                           "]
[1082,"SDWIS","GE","IRON, DISSOLVED                         "]
[1029,"SDWIS","GE","IRON, SUSPENDED                         "]
[4134,"SDWIS","GE","IRON-55                                 "]
[4136,"SDWIS","GE","IRON-59                                 "]
[2091,"SDWIS","GE","ISO-OCTANE                              "]
[2092,"SDWIS","GE","ISOBUTYL ACETATE                        "]
[2093,"SDWIS","GE","ISOBUTYL ALCOHOL                        "]
[2060,"SDWIS","GE","ISOFENPHOS (OLFANOL)                    "]
[2262,"SDWIS","GE","ISOPHORONE                              "]
[2094,"SDWIS","GE","ISOPROPYL ACETATE                       "]
[2095,"SDWIS","GE","ISOPROPYL ALCOHOL                       "]
[2245,"SDWIS","GE","ISOPROPYL ETHER                         "]
[2994,"SDWIS","GE","ISOPROPYLBENZENE                        "]
[2370,"SDWIS","GE","KELTHANE (DICOFAL)                      "]
[2930,"SDWIS","GE","KEPONE                                  "]
[2374,"SDWIS","GE","KEROSENE                                "]
[3024,"SDWIS","GE","KLEBSIELLA                              "]
[1997,"SDWIS","GE","LANGELIER INDEX                         "]
[4280,"SDWIS","GE","LANTHANUM-140                           "]
[1030,"SDWIS","PB","LEAD                                    "]
[5000,"SDWIS","PB","LEAD & COPPER RULE                      "]
[4370,"SDWIS","PB","LEAD-203                                "]
[4372,"SDWIS","PB","LEAD-210                                "]
[3012,"SDWIS","GE","LEGIONELLA                              "]
[3021,"SDWIS","GE","LEPTOSPIRES                             "]
[2283,"SDWIS","GE","LINURON                                 "]
[1083,"SDWIS","GE","LITHIUM                                 "]
[4330,"SDWIS","GE","LUTETIUM-177                            "]
[2967,"SDWIS","GE","M-DICHLOROBENZENE                       "]
[1031,"SDWIS","GE","MAGNESIUM                               "]
[2058,"SDWIS","GE","MALATHION                               "]
[4101,"SDWIS","GE","MAN-MADE BETA PARTICLE & PHOTON EMITTERS"]
[1032,"SDWIS","GE","MANGANESE                               "]
[1033,"SDWIS","GE","MANGANESE, SUSPENDED                    "]
[4132,"SDWIS","GE","MANGANESE-54                            "]
[1089,"SDWIS","GE","MBAS - FOAMING AGENTS (SURFACTANTS)     "]
[2113,"SDWIS","GE","MCPA                                    "]
[2112,"SDWIS","GE","MECOPROP                                "]
[1035,"SDWIS","GE","MERCURY                                 "]
[2253,"SDWIS","GE","METASYSTOX (DEMETONMETHYL)              "]
[2467,"SDWIS","GE","METHACRYLONITRILE                       "]
[2441,"SDWIS","GE","METHANE                                 "]
[2024,"SDWIS","GE","METHIOCARB                              "]
[2022,"SDWIS","GE","METHOMYL                                "]
[2015,"SDWIS","GE","METHOXYCHLOR                            "]
[2442,"SDWIS","GE","METHYL ACETATE                          "]
[2443,"SDWIS","GE","METHYL ALCOHOL                          "]
[2444,"SDWIS","GE","METHYL CELLOSOLVE                       "]
[2247,"SDWIS","GE","METHYL ETHYL KETONE (MEK)               "]
[2475,"SDWIS","GE","METHYL GLYOXAL                          "]
[2458,"SDWIS","GE","METHYL IODINE                           "]
[2249,"SDWIS","GE","METHYL ISOBUTYL KETONE                  "]
[2295,"SDWIS","GE","METHYL METHACRYLATE                     "]
[2251,"SDWIS","GE","METHYL TERT-BUTYL ETHER (MTBE)          "]
[2045,"SDWIS","GE","METOLACHLOR                             "]
[2595,"SDWIS","GE","METRIBUZIN (SENCOR)                     "]
[3500,"SDWIS","GE","MICROSPORIDIA                           "]
[2932,"SDWIS","GE","MIREX                                   "]
[2590,"SDWIS","GE","MOCAP                                   "]
[2626,"SDWIS","GE","MOLINATE (ORDRAM)                       "]
[1084,"SDWIS","GE","MOLYBDENUM                              "]
[4190,"SDWIS","GE","MOLYBDENUM-93                           "]
[4192,"SDWIS","GE","MOLYBDENUM-99                           "]
[2338,"SDWIS","GE","MONOBROMOACETIC ACID                    "]
[2453,"SDWIS","GE","MONOBROMOACETIC ACID                    "]
[2335,"SDWIS","GE","MONOCHLOROACETIC ACID                   "]
[2450,"SDWIS","GE","MONOCHLOROACETIC ACID                   "]
[2989,"SDWIS","GE","MONOCHLOROBENZENE                       "]
[2084,"SDWIS","GE","N-BUTYL ALCOHOL                         "]
[2422,"SDWIS","GE","N-BUTYLBENZENE                          "]
[2376,"SDWIS","GE","N-HEXANE                                "]
[2316,"SDWIS","GE","N-NITROSODI-N-PROPYLAMINE               "]
[2314,"SDWIS","GE","N-NITROSODIMETHYLAMINE                  "]
[2229,"SDWIS","GE","N-NITROSODIPHENYLAMINE                  "]
[2446,"SDWIS","GE","N-PROPYL ALCOHOL                        "]
[2998,"SDWIS","GE","N-PROPYLBENZENE                         "]
[2248,"SDWIS","GE","NAPHTHALENE                             "]
[4290,"SDWIS","GE","NEODYMIUM-147                           "]
[1036,"SDWIS","GE","NICKEL                                  "]
[4144,"SDWIS","GE","NICKEL-59                               "]
[4146,"SDWIS","GE","NICKEL-63                               "]
[4186,"SDWIS","GE","NIOBIUM-93                              "]
[4188,"SDWIS","GE","NIOBIUM-95                              "]
[1040,"SDWIS","GE","NITRATE (AS N)                          "]
[1038,"SDWIS","GE","NITRATE+NITRITE (AS N)                  "]
[1041,"SDWIS","GE","NITRITE (AS N)                          "]
[2254,"SDWIS","GE","NITROBENZENE                            "]
[1037,"SDWIS","GE","NITROGEN, TOTAL KJELDAHL (AS N)         "]
[1003,"SDWIS","GE","NITROGEN-AMMONIA (AS N)                 "]
[3005,"SDWIS","GE","NON-COLIFORM GROWTH IDENTIFICATION      "]
[2480,"SDWIS","GE","NONANAL                                 "]
[4999,"SDWIS","GE","NOTE: (RESERVED BY MSIS)                "]
[1999,"SDWIS","GE","NOTE: (RESERVED BY MSIS)                "]
[2999,"SDWIS","GE","NOTE: (RESERVED BY MSIS)                "]
[2965,"SDWIS","GE","O-CHLOROTOLUENE                         "]
[2968,"SDWIS","GE","O-DICHLOROBENZENE                       "]
[2478,"SDWIS","GE","OCTANAL                                 "]
[1920,"SDWIS","GE","ODOR                                    "]
[1090,"SDWIS","GE","OIL & GREASE                            "]
[1044,"SDWIS","GE","ORTHOPHOSPHATE                          "]
[4348,"SDWIS","GE","OSMIUM-185                              "]
[4350,"SDWIS","GE","OSMIUM-191                              "]
[4352,"SDWIS","GE","OSMIUM-193                              "]
[2036,"SDWIS","GE","OXAMYL (VYDATE)                         "]
[1076,"SDWIS","GE","OXYGEN DEMAND, CHEMICAL (COD)           "]
[1092,"SDWIS","GE","OXYGEN DEMAND, TOTAL                    "]
[1096,"SDWIS","GE","OZONE                                   "]
[1014,"SDWIS","GE","OZONE RESIDUAL                          "]
[2330,"SDWIS","GE","P-CHLORO-M-CRESOL                       "]
[2966,"SDWIS","GE","P-CHLOROTOLUENE                         "]
[2969,"SDWIS","GE","P-DICHLOROBENZENE                       "]
[2030,"SDWIS","GE","P-ISOPROPYLTOLUENE                      "]
[2038,"SDWIS","GE","PAHS                                    "]
[4212,"SDWIS","GE","PALLADIUM-103                           "]
[4214,"SDWIS","GE","PALLADIUM-107                           "]
[2028,"SDWIS","GE","PARAQUAT                                "]
[2064,"SDWIS","GE","PARATHION - ETHYL                       "]
[2399,"SDWIS","GE","PCB 1262                                "]
[2255,"SDWIS","GE","PENDIMETHYLIN                           "]
[2327,"SDWIS","GE","PENTACHLOROETHANE                       "]
[2326,"SDWIS","GE","PENTACHLOROPHENOL                       "]
[2473,"SDWIS","GE","PENTANAL                                "]
[2325,"SDWIS","GE","PENTANE                                 "]
[1039,"SDWIS","GE","PERCHLORATE                             "]
[2114,"SDWIS","GE","PERMETHRIN (MIXED, CIS, TRANS)          "]
[2275,"SDWIS","GE","PERMETHRIN, TRANS                       "]
[1925,"SDWIS","GE","PH                                      "]
[1066,"SDWIS","GE","PH, CACO3 STABILITY SU                  "]
[2278,"SDWIS","GE","PHENANTHRENE                            "]
[2910,"SDWIS","GE","PHENOLS                                 "]
[2605,"SDWIS","GE","PHORATE                                 "]
[2073,"SDWIS","GE","PHOSDRIN                                "]
[1043,"SDWIS","GE","PHOSPHATE (AS PO4)                      "]
[1073,"SDWIS","GE","PHOSPHATE, REACTIVE                     "]
[1093,"SDWIS","GE","PHOSPHORUS                              "]
[1072,"SDWIS","GE","PHOSPHORUS, SOLUBLE                     "]
[4112,"SDWIS","GE","PHOSPHORUS-32                           "]
[4012,"SDWIS","GE","PHOTON EMITTERS                         "]
[2040,"SDWIS","GE","PICLORAM                                "]
[4358,"SDWIS","GE","PLATINUM-191                            "]
[4360,"SDWIS","GE","PLATINUM-193                            "]
[4362,"SDWIS","GE","PLATINUM-193M                           "]
[4380,"SDWIS","GE","POLONIUM-210                            "]
[2383,"SDWIS","GE","POLYCHLORINATED BIPHENYLS (PCB)         "]
[1042,"SDWIS","GE","POTASSIUM                               "]
[4044,"SDWIS","GE","POTASSIUM-40                            "]
[4288,"SDWIS","GE","PRASEODYMIUM-143                        "]
[4292,"SDWIS","GE","PROMETHIUM-147                          "]
[4294,"SDWIS","GE","PROMETHIUM-148                          "]
[4296,"SDWIS","GE","PROMETHIUM-148M                         "]
[4298,"SDWIS","GE","PROMETHIUM-149                          "]
[2029,"SDWIS","GE","PROMETON (P-CYMENE)                     "]
[2077,"SDWIS","GE","PROPACHLOR                              "]
[2471,"SDWIS","GE","PROPANAL                                "]
[2289,"SDWIS","GE","PROPANIL                                "]
[2256,"SDWIS","GE","PROPAZINE                               "]
[2267,"SDWIS","GE","PROPHOS                                 "]
[2468,"SDWIS","GE","PROPIONITRILE                           "]
[2023,"SDWIS","GE","PROPOXUR (BAYGON)                       "]
[2445,"SDWIS","GE","PROPYL ACETATE                          "]
[4382,"SDWIS","GE","PROTACTINIUM-233                        "]
[2615,"SDWIS","GE","PROWL                                   "]
[3017,"SDWIS","GE","PSEUDOMONAS                             "]
[7500,"SDWIS","GE","PUBLIC NOTICE RULE                      "]
[2288,"SDWIS","GE","PYRENE                                  "]
[4010,"SDWIS","GE","RADIUM, COMBINED (226, 228)             "]
[4020,"SDWIS","GE","RADIUM-226                              "]
[4030,"SDWIS","GE","RADIUM-228                              "]
[4004,"SDWIS","GE","RADON 222                               "]
[2096,"SDWIS","GE","RDX                                     "]
[1059,"SDWIS","GE","RESIDUE, FILTERABLE FIXED               "]
[1058,"SDWIS","GE","RESIDUE, FILTERABLE VOLATILE            "]
[1063,"SDWIS","GE","RESIDUE, NONFILTERABLE FIXED            "]
[1077,"SDWIS","GE","RESIDUE, NONFILTERABLE, VOLATILE        "]
[1071,"SDWIS","GE","RESIDUE, SETTLABLE                      "]
[1070,"SDWIS","GE","RESIDUE, TOTAL                          "]
[1057,"SDWIS","GE","RESIDUE, TOTAL FILTERABLE               "]
[1061,"SDWIS","GE","RESIDUE, TOTAL FIXED                    "]
[1060,"SDWIS","GE","RESIDUE, TOTAL VOLATILE                 "]
[4342,"SDWIS","GE","RHENIUM-183                             "]
[4344,"SDWIS","GE","RHENIUM-186                             "]
[4346,"SDWIS","GE","RHENIUM-187                             "]
[4210,"SDWIS","GE","RHODIUM-105                             "]
[4166,"SDWIS","GE","RUBIDIUM-86                             "]
[4168,"SDWIS","GE","RUBIDIUM-87                             "]
[4206,"SDWIS","GE","RUTHENIUM-103                           "]
[4208,"SDWIS","GE","RUTHENIUM-106                           "]
[4204,"SDWIS","GE","RUTHENIUM-97                            "]
[3007,"SDWIS","GE","SALMONELLA                              "]
[4300,"SDWIS","GE","SAMARIUM-151                            "]
[4302,"SDWIS","GE","SAMARIUM-153                            "]
[1998,"SDWIS","GE","SATURATION INDEX                        "]
[1995,"SDWIS","GE","SCALE FORMING                           "]
[4122,"SDWIS","GE","SCANDIUM-46                             "]
[4124,"SDWIS","GE","SCANDIUM-47                             "]
[4126,"SDWIS","GE","SCANDIUM-48                             "]
[2085,"SDWIS","GE","SEC-BUTYL ALCOHOL                       "]
[2428,"SDWIS","GE","SEC-BUTYLBENZENE                        "]
[1045,"SDWIS","GE","SELENIUM                                "]
[4160,"SDWIS","GE","SELENIUM-75                             "]
[4162,"SDWIS","GE","SELENIUM-79                             "]
[3016,"SDWIS","GE","SHIGELLA                                "]
[2301,"SDWIS","GE","SIDURON                                 "]
[1049,"SDWIS","GE","SILICA                                  "]
[1050,"SDWIS","GE","SILVER                                  "]
[4216,"SDWIS","GE","SILVER-105                              "]
[4218,"SDWIS","GE","SILVER-110                              "]
[4222,"SDWIS","GE","SILVER-111                              "]
[2037,"SDWIS","GE","SIMAZINE                                "]
[1052,"SDWIS","GE","SODIUM                                  "]
[1047,"SDWIS","GE","SODIUM, ADSORPTION RATIO                "]
[1046,"SDWIS","GE","SODIUM, PERCENT                         "]
[4110,"SDWIS","GE","SODIUM-22                               "]
[1930,"SDWIS","GE","SOLIDS, TOTAL DISSOLVED (TDS)           "]
[1993,"SDWIS","GE","STABILITY INDEX                         "]
[3004,"SDWIS","GE","STAPHYLOCOCCUS                          "]
[1051,"SDWIS","GE","STRONTIUM                               "]
[4170,"SDWIS","GE","STRONTIUM-85                            "]
[4172,"SDWIS","GE","STRONTIUM-89                            "]
[4174,"SDWIS","GE","STRONTIUM-90                            "]
[2996,"SDWIS","GE","STYRENE                                 "]
[1055,"SDWIS","GE","SULFATE                                 "]
[4114,"SDWIS","GE","SULFUR-35                               "]
[200,"SDWIS","GE","SURFACE WATER TREATMENT RULE (SWTR)     "]
[2923,"SDWIS","GE","SUVA (SPECFIC ULTRAVIOLET ABSORBANCE)   "]
[4334,"SDWIS","GE","TANTALUM-182                            "]
[2271,"SDWIS","GE","TEBUTHIURON                             "]
[4194,"SDWIS","GE","TECHNETIUM-96                           "]
[4196,"SDWIS","GE","TECHNETIUM-97                           "]
[4198,"SDWIS","GE","TECHNETIUM-97M                          "]
[4200,"SDWIS","GE","TECHNETIUM-99                           "]
[4202,"SDWIS","GE","TECHNETIUM-99M                          "]
[2371,"SDWIS","GE","TEDION                                  "]
[4248,"SDWIS","GE","TELLURIUM-125                           "]
[4250,"SDWIS","GE","TELLURIUM-127                           "]
[4252,"SDWIS","GE","TELLURIUM-127M                          "]
[4254,"SDWIS","GE","TELLURIUM-129                           "]
[4256,"SDWIS","GE","TELLURIUM-129M                          "]
[4258,"SDWIS","GE","TELLURIUM-132                           "]
[1996,"SDWIS","GE","TEMPERATURE (C)                         "]
[2272,"SDWIS","GE","TERBACIL                                "]
[4314,"SDWIS","GE","TERBIUM-160                             "]
[2934,"SDWIS","GE","TERRACLOR (PCNB)                        "]
[2426,"SDWIS","GE","TERT-BUTYLBENZENE                       "]
[2987,"SDWIS","GE","TETRACHLOROETHYLENE                     "]
[2263,"SDWIS","GE","TETRAHYDROFURAN                         "]
[1085,"SDWIS","GE","THALLIUM                                "]
[4368,"SDWIS","GE","THALLIUM-204                            "]
[2303,"SDWIS","GE","THIDIAZURON                             "]
[2727,"SDWIS","GE","THIOBENCARB (BOLERO)                    "]
[4324,"SDWIS","GE","THULIUM-170                             "]
[4326,"SDWIS","GE","THULIUM-171                             "]
[1086,"SDWIS","GE","TIN                                     "]
[4234,"SDWIS","GE","TIN-113                                 "]
[4236,"SDWIS","GE","TIN-123                                 "]
[4238,"SDWIS","GE","TIN-125                                 "]
[1087,"SDWIS","GE","TITANIUM                                "]
[2991,"SDWIS","GE","TOLUENE                                 "]
[1000,"SDWIS","GE","TOTAL CHLORINE                          "]
[2456,"SDWIS","GE","TOTAL HALOACETIC ACIDS (HAA5)           "]
[2921,"SDWIS","GE","TOTAL ORGANIC HALIDE (TOX)              "]
[2950,"SDWIS","GE","TOTAL TRIHALOMETHANES (TTHM)            "]
[2020,"SDWIS","GE","TOXAPHENE                               "]
[2979,"SDWIS","GE","TRANS-1,2-DICHLOROETHYLENE              "]
[2226,"SDWIS","GE","TRANS-1,2-DICHLOROPROPENE               "]
[2224,"SDWIS","GE","TRANS-1,3-DICHLOROPROPENE               "]
[2970,"SDWIS","GE","TRANS-1,4-DICHLORO-2-BUTENE             "]
[2273,"SDWIS","GE","TRANS-NONACHLOR                         "]
[2452,"SDWIS","GE","TRICHLOROACETIC ACID                    "]
[2337,"SDWIS","GE","TRICHLOROACETIC ACID                    "]
[2219,"SDWIS","GE","TRICHLOROACETONITRILE                   "]
[2984,"SDWIS","GE","TRICHLOROETHYLENE                       "]
[2218,"SDWIS","GE","TRICHLOROFLUOROMETHANE                  "]
[2904,"SDWIS","GE","TRICHLOROTRIFLUOROETHANE (FREON 113)    "]
[2107,"SDWIS","GE","TRICLOPYR                               "]
[2055,"SDWIS","GE","TRIFLURALIN                             "]
[2949,"SDWIS","GE","TRIHALOMETHANE,MAX POTENTIAL (MTP)      "]
[2061,"SDWIS","GE","TRITHION                                "]
[4102,"SDWIS","GE","TRITIUM                                 "]
[4336,"SDWIS","GE","TUNGSTEN-181                            "]
[4338,"SDWIS","GE","TUNGSTEN-185                            "]
[4340,"SDWIS","GE","TUNGSTEN-187                            "]
[100,"SDWIS","GE","TURBIDITY                               "]
[4006,"SDWIS","GE","URANIUM, COMBINED                       "]
[4007,"SDWIS","GE","URANIUM-234                             "]
[4008,"SDWIS","GE","URANIUM-235                             "]
[4009,"SDWIS","GE","URANIUM-238                             "]
[2922,"SDWIS","GE","UV ABSORBANCE @254 NM                   "]
[1088,"SDWIS","GE","VANADIUM                                "]
[4128,"SDWIS","GE","VANADIUM-48                             "]
[3020,"SDWIS","GE","VIBRIO CHOLERAE                         "]
[2520,"SDWIS","GE","VINYL 2-CHLOROETHYL ETHER               "]
[2447,"SDWIS","GE","VINYL ACETATE                           "]
[2976,"SDWIS","GE","VINYL CHLORIDE                          "]
[3010,"SDWIS","GE","VIRUS                                   "]
[2995,"SDWIS","GE","XYLENE, META                            "]
[2963,"SDWIS","GE","XYLENE, META AND PARA                   "]
[2997,"SDWIS","GE","XYLENE, ORTHO                           "]
[2962,"SDWIS","GE","XYLENE, PARA                            "]
[2955,"SDWIS","GE","XYLENES                                 "]
[3022,"SDWIS","GE","YERSINIA ENTEROCOLITICA                 "]
[4328,"SDWIS","GE","YTTERBIUM-175                           "]
[4176,"SDWIS","GE","YTTRIUM-90                              "]
[4178,"SDWIS","GE","YTTRIUM-91                              "]
[4180,"SDWIS","GE","YTTRIUM-91M                             "]
[1095,"SDWIS","GE","ZINC                                    "]
[4148,"SDWIS","GE","ZINC-65                                 "]
[4182,"SDWIS","GE","ZIRCONIUM-93                            "]
[4184,"SDWIS","GE","ZIRCONIUM-95                            "]

{"sheet":"Instructions","index":3,"n_rows":32,"n_cols":3,"rows_kept":32,"cut":false,"hidden":false,"merged":[[1,1,1,2],[0,1,0,2],[2,1,2,2],[3,1,3,2],[4,1,4,2],[5,1,5,2],[6,1,6,2],[7,1,7,2],[19,1,19,2],[8,1,8,2],[9,1,9,2],[10,1,10,2],[11,1,11,2],[12,1,12,2],[13,1,13,2],[14,1,14,2],[15,1,15,2],[16,1,16,2],[17,1,17,2],[18,1,18,2],[20,1,20,2],[21,1,21,2],[22,1,22,2],[23,1,23,2],[25,0,25,2]]}
["Lab Sample Number*","Enter the sample number issued by the reporting lab. Sample numbers are limited to 10 digits. The exact same sample number cannot appear from the same lab on more than one report in one calendar year."]
["PWS ID Number*","Enter the seven digit Public Water System Identification (PWS ID) Number assigned by Ohio EPA. "]
["Water Facility State Code*","Enter the STU ID or the specific Facility code assigned to the location the sample was collected. This code should be associated with at least one Entry Point (EP). The Facility Code for a water treatment plant, for example, will be a series of numbers. For help, refer to DWW or eDWR (reference data menu)."]
["Sample Point ID*","Enter the Sample Monitoring Point assigned to the sample location and/or from the PWS’s monitoring schedule. This must be an Entry Point (EP001, EP002, etc.). For help, refer to DWW or eDWR (reference data menu)."]
["Sample Collection Date*","Enter the date (Month/Day/Year) which the sample was taken."]
["Sample Collection Time","Enter the time the sample was taken - HHMM."]
["Lab Receipt Date","Enter the date (Month/Day/Year) which the sample was received at the lab."]
["Sample Rejection Reason","Select from the dropdown list the reason the entire sample was rejected for analysis. Leave blank if sample was analyzed. Rejected samples are NOT valid for initial monitoring."]
["Sample Type*","Select \"Routine-Compliance\" from the dropdown list."]
["Pb/Cu Location Type","Leave blank."]
["Collection Address","Leave blank."]
["Comments","Include any additional information to further describe the sample location, data quality results or any other pertinent information about the sample."]
["Analyte Code*","Select the Appropriate SDWIS Code and analyte name from the list. "]
["Analysis Completion Date*","Enter the date the analysis was completed."]
["Analysis Completion Time","Enter the time the analysis was completed."]
["Data Quality*","Select accepted or rejected depending on the validity of the sample result. If the sample was rejected, it may NOT be used for initial monitoring."]
["Data Quality Reason","Required if data Quality is rejected; select the reason from the list."]
["Analysis Method Code*","Enter either 533 (for Method 533) or 537.1 (for Method 537.1, version 2.0). No other methods are accepted under the federal PFAS rule."]
["Less Than Indicator*","Select “<” or leave blank as appropriate."]
["Result*","If the results indicator was blank, enter the results value. If the result indicator was \"<\", enter the detection limit for the analysis."]
["Result Unit Code*","Select the appropriate units for the analytical result."]
["Analytical Lab","Enter the certification number of the lab which analyzed the sample."]
["Analyst","Enter the number assigned by the Ohio EPA for the approved analyst."]
["QC Date","Enter the date the analytical lab completed the Quality Control for the sample."]
[]
["Examples of Water Facility State Code and Sample Point ID Pairs (PFAS must be EP samples, highlighted below):"]
["Sample Location","Sample Point ID","Water Facility State Code"]
["Distribution Sample","DS000","DS1"]
["Distribution Sample","MR000","DS1"]
["Entry Point STU #1","EP001",2562342]
["Entry Point STU #2","EP002",2561212]
["Well #1 Raw Sample","RS001","WL00321"]